BDBM50091573 1-{3-Methyl-2-[(naphthalene-2-carbonyl)-amino]-butyryl}-pyrrolidine-2-carboxylic acid (1-formyl-3-methanesulfonylamino-3-oxo-propyl)-amide::CHEMBL114830
SMILES CC(C)[C@H](NC(=O)c1ccc2ccccc2c1)C(=O)N1CCC[C@H]1C(=O)NC(CC(=O)NS(C)(=O)=O)C=O
InChI Key InChIKey=IGFYXXJBAZZOHF-ZXNYFWILSA-N
Data  1 IC50
  Tab Delimited (TSV)   2D SDfile   Computed 3D by Vconf -m prep SDfile
Find this compound or compounds like it in BindingDB:
Activity Spreadsheet -- Enzyme Inhibition Constant Data from BindingDB
Found 1 hit for monomerid = 50091573
TargetCaspase-1(Homo sapiens (Human))
Basf Bioresearch
Curated by ChEMBL
LigandPNGBDBM50091573(1-{3-Methyl-2-[(naphthalene-2-carbonyl)-amino]-but...)
Affinity DataIC50:  38nM. Assay description: Dissociation constant for inhibition of caspase-1
In DepthDetails ArticlePubMed