BDBM50092150 2,5-Dihydroxy-3-(1-methyl-1H-indol-3-yl)-6-phenyl-[1,4]benzoquinone::CHEMBL116306
SMILES Cn1cc(C2C(=O)C(=O)C(C(=O)C2=O)c2ccccc2)c2ccccc12
InChI Key InChIKey=CPENGUJVJBOOMP-UHFFFAOYSA-N
Data  1 EC50
  Tab Delimited (TSV)   2D SDfile   Computed 3D by Vconf -m prep SDfile
Find this compound or compounds like it in BindingDB:
Activity Spreadsheet -- Enzyme Inhibition Constant Data from BindingDB
Found 1 hit for monomerid = 50092150
TargetInsulin receptor(Homo sapiens (Human))
Merck Research Laboratories
Curated by ChEMBL
LigandPNGBDBM50092150(2,5-Dihydroxy-3-(1-methyl-1H-indol-3-yl)-6-phenyl-...)
Affinity DataEC50:  300nM. Assay description: Activation of human insulin receptor tyrosine kinase (IRTK)
In DepthDetails ArticlePubMed