BDBM50093208 2-(5-Bromo-1H-indol-3-yl)-N-[3-(4-{3-[2-(5-bromo-1H-indol-3-yl)-acetylamino]-propylamino}-butylamino)-propyl]-acetamide::CHEMBL76694
SMILES Brc1ccc2[nH]cc(CC(=O)NCCCNCCCCNCCCNC(=O)Cc3c[nH]c4ccc(Br)cc34)c2c1
InChI Key InChIKey=PVPRCQOYXLHSFL-UHFFFAOYSA-N
Data  1 KI
  Tab Delimited (TSV)   2D SDfile   Computed 3D by Vconf -m prep SDfile
Find this compound or compounds like it in BindingDB:
Activity Spreadsheet -- Enzyme Inhibition Constant Data from BindingDB
Found 1 hit for monomerid = 50093208
TargetTrypanothione reductase(Trypanosoma cruzi)
University Of Southamton
Curated by ChEMBL
LigandPNGBDBM50093208(2-(5-Bromo-1H-indol-3-yl)-N-[3-(4-{3-[2-(5-bromo-1...)
Affinity DataKi:  76nM. Assay description: The compound was evaluated for inhibition of trypanothione reductase enzyme
In DepthDetails ArticlePubMed