BDBM50093758 CHEMBL3585829
SMILES COC(=O)CCN1C(Nc2ccccc2C1=O)c1ccccc1
InChI Key InChIKey=DMTGZBZEVHRGNT-UHFFFAOYSA-N
Data  2 IC50
  Tab Delimited (TSV)   2D SDfile   Computed 3D by Vconf -m prep SDfile
Find this compound or compounds like it in BindingDB:
Activity Spreadsheet -- Enzyme Inhibition Constant Data from BindingDB
Found 2 hits for monomerid = 50093758
TargetAmine oxidase [flavin-containing] A(Bos taurus)
Alexandria University
Curated by ChEMBL
LigandPNGBDBM50093758(CHEMBL3585829)
Affinity DataIC50:  92nM. Assay description: Inhibition of bovine brain mitochondria MAO-A using serotonin substrate after 60 mins by fluorimetric method
In DepthDetails ArticlePubMed
TargetAmine oxidase [flavin-containing] B(Bos taurus)
Alexandria University
Curated by ChEMBL
LigandPNGBDBM50093758(CHEMBL3585829)
Affinity DataIC50:  8.60E+5nM. Assay description: Inhibition of bovine brain mitochondria MAO-A using serotonin substrate after 60 mins by fluorimetric method
In DepthDetails ArticlePubMed