BDBM50093782 CHEMBL3585935
SMILES Cc1nn(C)cc1OCC1(CC1C(=O)Nc1ccc(cn1)C#N)c1ccccc1
InChI Key InChIKey=WIYUZYBFCWCCQJ-GBXABWFSSA-N
Data  2 KI
  Tab Delimited (TSV)   2D SDfile   Computed 3D by Vconf -m prep SDfile
Find this compound or compounds like it in BindingDB:
Activity Spreadsheet -- Enzyme Inhibition Constant Data from BindingDB
Found 2 hits for monomerid = 50093782
TargetOrexin receptor type 2(Homo sapiens (Human))
Eisai
Curated by ChEMBL
LigandPNGBDBM50093782(CHEMBL3585935)
Affinity DataKi:  204nM. Assay description: Binding affinity to human OX2R by radioligand displacement binding assay
In DepthDetails ArticlePubMed
TargetOrexin/Hypocretin receptor type 1(Homo sapiens (Human))
Eisai
Curated by ChEMBL
LigandPNGBDBM50093782(CHEMBL3585935)
Affinity DataKi: >2.00E+3nM. Assay description: Binding affinity to human OX1R by radioligand displacement binding assay
In DepthDetails ArticlePubMed