BDBM50093812 3-(5-{1-[3-(2-Carboxy-ethylcarbamoyl)-5-chloro-4-hydroxy-phenyl]-4-[(3S,10S,13R,17R)-17-(1,5-dimethyl-hexyl)-10,13-dimethyl-hexadecahydro-cyclopenta[a]phenanthren-3-yl]-but-1-enyl}-3-chloro-2-hydroxy-benzoylamino)-propionic acid::3-(5-{1-[3-(2-Carboxy-ethylcarbamoyl)-5-chloro-4-hydroxy-phenyl]-4-[17-(1,5-dimethyl-hexyl)-10,13-dimethyl-hexadecahydro-cyclopenta[a]phenanthren-3-yl]-but-1-enyl}-3-chloro-2-hydroxy-benzoylamino)-propionic acid::CHEMBL84320
SMILES [#6]-[#6](-[#6])-[#6]-[#6]-[#6]-[#6](-[#6])-[#6@H]1-[#6]-[#6]-[#6]2-[#6]-3-[#6]-[#6]-[#6]4-[#6]-[#6@@H](-[#6]-[#6]\[#6]=[#6](\c5cc(Cl)c(-[#8])c(c5)-[#6](=O)-[#7]-[#6]-[#6]-[#6](-[#8])=O)-c5cc(Cl)c(-[#8])c(c5)-[#6](=O)-[#7]-[#6]-[#6]-[#6](-[#8])=O)-[#6]-[#6][C@]4([#6])[#6]-3-[#6]-[#6][C@]12[#6]
InChI Key InChIKey=BBZNSHRWMUNFHZ-HSGHNJCLSA-N
Data  1 EC50
  Tab Delimited (TSV)   2D SDfile   Computed 3D by Vconf -m prep SDfile
Find this compound or compounds like it in BindingDB:
Activity Spreadsheet -- Enzyme Inhibition Constant Data from BindingDB
Found 1 hit for monomerid = 50093812
TargetT-cell surface glycoprotein CD4(Homo sapiens (Human))
Purdue University
Curated by ChEMBL
LigandPNGBDBM50093812(3-(5-{1-[3-(2-Carboxy-ethylcarbamoyl)-5-chloro-4-h...)
Affinity DataEC50:  1.20E+5nM. Assay description: In vitro inhibition of cytopathic effect was determined against HIV-2 ROD in MT-4 cells using MTS cytoprotection assay
In DepthDetails ArticlePubMed