BDBM50094194 (R)-2-(3-Methoxy-10,13-dimethyl-2,3,4,7,8,9,10,11,12,13,14,15,16,17-tetradecahydro-1H-cyclopenta[a]phenanthren-17-yl)-oxirane::(S)-2-(3-Methoxy-10,13-dimethyl-2,3,4,7,8,9,10,11,12,13,14,15,16,17-tetradecahydro-1H-cyclopenta[a]phenanthren-17-yl)-oxirane::CHEMBL136150
SMILES COC1CCC2(C)C3CCC4(C)C(CCC4C3CC=C2C1)C1CO1
InChI Key InChIKey=HDJJLEIDMKOAQL-UHFFFAOYSA-N
Data  1 IC50
  Tab Delimited (TSV)   2D SDfile   Computed 3D by Vconf -m prep SDfile
Find this compound or compounds like it in BindingDB:
Activity Spreadsheet -- Enzyme Inhibition Constant Data from BindingDB
Found 1 hit for monomerid = 50094194
TargetSteroid 17-alpha-hydroxylase/17,20 lyase(Rattus norvegicus (Rat))
University Of The Saarland
Curated by ChEMBL
LigandPNGBDBM50094194((R)-2-(3-Methoxy-10,13-dimethyl-2,3,4,7,8,9,10,11,...)
Affinity DataIC50: >1.25E+5nM. Assay description: Tested for inhibitory activity against Cytochrome P450 17 from rat testicular microsomes
In DepthDetails ArticlePubMed