BDBM50094892 9,10-anthraquinone::9,10-quinone::Az-Q::CHEMBL55659::anthradione
SMILES O=C1c2ccccc2C(=O)c2ccccc12
InChI Key InChIKey=RZVHIXYEVGDQDX-UHFFFAOYSA-N
Data  6 IC50
PDB links: 1 PDB ID matches this monomer.
  Tab Delimited (TSV)   2D SDfile   Computed 3D by Vconf -m prep SDfile
Find this compound or compounds like it in BindingDB:
Activity Spreadsheet -- Enzyme Inhibition Constant Data from BindingDB
Found 6 hits for monomerid = 50094892
TargetM-phase inducer phosphatase 2(Homo sapiens (Human))
Virginia Polytechnic Institute And State University
Curated by ChEMBL
LigandPNGBDBM50094892(9,10-anthraquinone | 9,10-quinone | Az-Q | CHEMBL5...)
Affinity DataIC50:  9.51E+3nM. Assay description: Inhibition of histidine-tagged human recombinant Cdc25B catalytic domain expressed in Escherichia coli
In DepthDetails ArticlePubMed
TargetDual specificity protein phosphatase 1(Mus musculus)
Virginia Polytechnic Institute And State University
Curated by ChEMBL
LigandPNGBDBM50094892(9,10-anthraquinone | 9,10-quinone | Az-Q | CHEMBL5...)
Affinity DataIC50: >5.00E+4nM. Assay description: Inhibition of histidine-tagged mouse MKP1 catalytic domain expressed in human Hela cells
In DepthDetails ArticlePubMed
TargetAmine oxidase [flavin-containing] A(Homo sapiens (Human))
North-West University
Curated by ChEMBL
LigandPNGBDBM50094892(9,10-anthraquinone | 9,10-quinone | Az-Q | CHEMBL5...)
Affinity DataIC50:  1.22E+5nM. Assay description: Inhibition of recombinant human MAO-A expressed in baculovirus infected BTI insect cells using kynuramine as substrate after 20 mins by fluorescence ...
In DepthDetails PubMed
TargetHistone-lysine N-methyltransferase EHMT1(Homo sapiens (Human))
Radboud University
Curated by ChEMBL
LigandPNGBDBM50094892(9,10-anthraquinone | 9,10-quinone | Az-Q | CHEMBL5...)
Affinity DataIC50: >1.00E+5nM. Assay description: Inhibition of wild type recombinant human histone lysine methyltransferase GLP (951 to 1235 residues) expressed in Escherichia coli Rosetta BL21 DE3 ...
In DepthDetails ArticlePubMed
TargetHistone-lysine N-methyltransferase EHMT2(Homo sapiens (Human))
Radboud University
Curated by ChEMBL
LigandPNGBDBM50094892(9,10-anthraquinone | 9,10-quinone | Az-Q | CHEMBL5...)
Affinity DataIC50: >1.00E+5nM. Assay description: Inhibition of wild type recombinant human histone lysine methyltransferase G9a (913 to 1193 residues) expressed in Escherichia coli Rosetta BL21 DE3 ...
In DepthDetails ArticlePubMed
TargetDual specificity protein phosphatase 6(Rattus norvegicus)
Virginia Polytechnic Institute And State University
Curated by ChEMBL
LigandPNGBDBM50094892(9,10-anthraquinone | 9,10-quinone | Az-Q | CHEMBL5...)
Affinity DataIC50: >5.00E+4nM. Assay description: Inhibition of histidine-tagged rat recombinant MKP3 catalytic domain expressed in Escherichia coli BL21(DE3)
In DepthDetails ArticlePubMed