BDBM50095019 CHEMBL3589724
SMILES O[C@@H]1CC[C@H](C[C@H]1N1CCC(CC1)c1ccccc1)OCCCF
InChI Key InChIKey=BCZUKXFKEOFPHY-VAMGGRTRSA-N
Data  2 KI
  Tab Delimited (TSV)   2D SDfile   Computed 3D by Vconf -m prep SDfile
Find this compound or compounds like it in BindingDB:
Activity Spreadsheet -- Enzyme Inhibition Constant Data from BindingDB
Found 2 hits for monomerid = 50095019
TargetSigma non-opioid intracellular receptor 1(RAT)
Institute Of Radiopharmaceutical Cancer Research
Curated by ChEMBL
LigandPNGBDBM50095019(CHEMBL3589724)
Affinity DataKi:  26nM. Assay description: Displacement of (-)-[3H]pentazocine from sigma1 receptor in Sprague-Dawley rat cortical membranes incubated for 2 hrs by liquid scintillation countin...
In DepthDetails ArticlePubMed
TargetVesicular acetylcholine transporter(Rattus norvegicus)
Institute Of Radiopharmaceutical Cancer Research
Curated by ChEMBL
LigandPNGBDBM50095019(CHEMBL3589724)
Affinity DataKi:  48nM. Assay description: Displacement of (-)-[3H]vesamicol from rat VAChT expressed in PC12 cell membranes incubated for 2 hrs by liquid scintillation counting based competit...
In DepthDetails ArticlePubMed