BDBM50095083 CHEMBL3589735
SMILES O[C@@H]1Cc2c(C[C@H]1N1CCC(CC1)c1ccccc1)cccc2NC(=O)c1ccc(F)cc1
InChI Key InChIKey=BXKSCEUJEPDZBI-UHFFFAOYSA-N
Data  2 KI
  Tab Delimited (TSV)   2D SDfile   Computed 3D by Vconf -m prep SDfile
Find this compound or compounds like it in BindingDB:
Activity Spreadsheet -- Enzyme Inhibition Constant Data from BindingDB
Found 2 hits for monomerid = 50095083
TargetVesicular acetylcholine transporter(Rattus norvegicus)
Institute Of Radiopharmaceutical Cancer Research
Curated by ChEMBL
LigandPNGBDBM50095083(CHEMBL3589735)
Affinity DataKi:  188nM. Assay description: Displacement of (-)-[3H]vesamicol from rat VAChT expressed in PC12 cell membranes incubated for 2 hrs by liquid scintillation counting based competit...
In DepthDetails ArticlePubMed
TargetSigma non-opioid intracellular receptor 1(RAT)
Institute Of Radiopharmaceutical Cancer Research
Curated by ChEMBL
LigandPNGBDBM50095083(CHEMBL3589735)
Affinity DataKi:  626nM. Assay description: Displacement of (-)-[3H]pentazocine from sigma1 receptor in Sprague-Dawley rat cortical membranes incubated for 2 hrs by liquid scintillation countin...
In DepthDetails ArticlePubMed