BDBM50095085 CHEMBL3589733
SMILES O[C@@H]1Cc2cccc(NC(=O)c3ccc(F)cc3)c2C[C@H]1N1CCC(CC1)c1ccccc1
InChI Key InChIKey=PWOQCZLPANHRRJ-UHFFFAOYSA-N
Data  2 KI
  Tab Delimited (TSV)   2D SDfile   Computed 3D by Vconf -m prep SDfile
Find this compound or compounds like it in BindingDB:
Activity Spreadsheet -- Enzyme Inhibition Constant Data from BindingDB
Found 2 hits for monomerid = 50095085
TargetVesicular acetylcholine transporter(Rattus norvegicus)
Institute Of Radiopharmaceutical Cancer Research
Curated by ChEMBL
LigandPNGBDBM50095085(CHEMBL3589733)
Affinity DataKi:  156nM. Assay description: Displacement of (-)-[3H]vesamicol from rat VAChT expressed in PC12 cell membranes incubated for 2 hrs by liquid scintillation counting based competit...
In DepthDetails ArticlePubMed
TargetSigma non-opioid intracellular receptor 1(RAT)
Institute Of Radiopharmaceutical Cancer Research
Curated by ChEMBL
LigandPNGBDBM50095085(CHEMBL3589733)
Affinity DataKi:  6.43E+3nM. Assay description: Displacement of (-)-[3H]pentazocine from sigma1 receptor in Sprague-Dawley rat cortical membranes incubated for 2 hrs by liquid scintillation countin...
In DepthDetails ArticlePubMed