BDBM50096432 CHEMBL3577157
SMILES CCCCCCCC\C=C/CCCCCCCCOCCCOP(O)(=O)OC[C@H](N)C(O)=O
InChI Key InChIKey=IBQCLMOWIXCFEY-AXKWSIDASA-N
Data  2 EC50
  Tab Delimited (TSV)   2D SDfile   Computed 3D by Vconf -m prep SDfile
Find this compound or compounds like it in BindingDB:
Activity Spreadsheet -- Enzyme Inhibition Constant Data from BindingDB
Found 2 hits for monomerid = 50096432
TargetPutative P2Y purinoceptor 10(Homo sapiens (Human))
The University Of Tokyo
Curated by ChEMBL
LigandPNGBDBM50096432(CHEMBL3577157)
Affinity DataEC50:  330nM. Assay description: Agonist activity at P2Y10 (unknown origin) transfected in HEK293A cells after 1 hr by TGFalpha shedding assay
In DepthDetails ArticlePubMed
TargetPutative P2Y purinoceptor 10(Homo sapiens (Human))
The University Of Tokyo
Curated by ChEMBL
LigandPNGBDBM50096432(CHEMBL3577157)
Affinity DataEC50:  331nM. Assay description: Agonist activity at P2Y10 (unknown origin) transfected in HEK293A cells after 1 hr by TGFalpha shedding assay
In DepthDetails ArticlePubMed