BDBM50096434 CHEMBL3577161
SMILES CCCCCCCC\C=C/CCCCCCCC(=O)OC[C@@H](O)COP(O)(=O)O[C@H](C)[C@H](N)C(O)=O
InChI Key InChIKey=TUOGAVKNETYDTH-QIGMQCQMSA-N
Data  2 EC50
  Tab Delimited (TSV)   2D SDfile   Computed 3D by Vconf -m prep SDfile
Find this compound or compounds like it in BindingDB:
Activity Spreadsheet -- Enzyme Inhibition Constant Data from BindingDB
Found 2 hits for monomerid = 50096434
TargetPutative P2Y purinoceptor 10(Homo sapiens (Human))
The University Of Tokyo
Curated by ChEMBL
LigandPNGBDBM50096434(CHEMBL3577161)
Affinity DataEC50:  2.20E+3nM. Assay description: Agonist activity at P2Y10 (unknown origin) transfected in HEK293A cells after 1 hr by TGFalpha shedding assay
In DepthDetails ArticlePubMed
TargetPutative P2Y purinoceptor 10(Homo sapiens (Human))
The University Of Tokyo
Curated by ChEMBL
LigandPNGBDBM50096434(CHEMBL3577161)
Affinity DataEC50:  2.24E+3nM. Assay description: Agonist activity at P2Y10 (unknown origin) transfected in HEK293A cells after 1 hr by TGFalpha shedding assay
In DepthDetails ArticlePubMed