BDBM50096626 4-{2-(4-Amino-cyclohexyl)-2-[((6S,8aS)-4-oxo-2-phenylmethanesulfonyl-octahydro-pyrrolo[1,2-a]pyrazine-6-carbonyl)-amino]-acetyl}-5-methyl-thiazole-2-carboxylic acid::CHEMBL3084830
SMILES [H][C@@]12CC[C@H](N1C(=O)CN(C2)S(=O)(=O)Cc1ccccc1)C(=O)NC([C@H]1CC[C@H](N)CC1)C(=O)c1nc(C)c(s1)C(O)=O
InChI Key InChIKey=DWUQFZTZODUVSJ-LSLDVHGISA-N
Data  2 KI
  Tab Delimited (TSV)   2D SDfile   Computed 3D by Vconf -m prep SDfile
Find this compound or compounds like it in BindingDB:
Activity Spreadsheet -- Enzyme Inhibition Constant Data from BindingDB
Found 2 hits for monomerid = 50096626
TargetProthrombin(Homo sapiens (Human))
Biochem Pharma
Curated by ChEMBL
LigandPNGBDBM50096626(4-{2-(4-Amino-cyclohexyl)-2-[((6S,8aS)-4-oxo-2-phe...)
Affinity DataKi:  80nM. Assay description: In vitro activity of the compound against human alpha thrombin was determined
In DepthDetails ArticlePubMed
TargetSerine protease 1(Homo sapiens (Human))
Biochem Pharma
Curated by ChEMBL
LigandPNGBDBM50096626(4-{2-(4-Amino-cyclohexyl)-2-[((6S,8aS)-4-oxo-2-phe...)
Affinity DataKi:  6.50E+4nM. Assay description: In vitro activity of the compound against human alpha trypsin was determined
In DepthDetails ArticlePubMed