BDBM50098136 5-Methylsulfanyl-4-[2-(2,4,5-trimethyl-phenylamino)-thiazol-4-yl]-thiophene-2-carboxamidine::CHEMBL440932
SMILES CSc1sc(cc1-c1csc(Nc2cc(C)c(C)cc2C)n1)C(N)=N
InChI Key InChIKey=YCMAPLMAEQZHAF-UHFFFAOYSA-N
Data  1 KI
  Tab Delimited (TSV)   2D SDfile   Computed 3D by Vconf -m prep SDfile
Find this compound or compounds like it in BindingDB:
Activity Spreadsheet -- Enzyme Inhibition Constant Data from BindingDB
Found 1 hit for monomerid = 50098136
TargetUrokinase-type plasminogen activator(Homo sapiens (Human))
3-Dimensional Pharmaceuticals
Curated by ChEMBL
LigandPNGBDBM50098136(5-Methylsulfanyl-4-[2-(2,4,5-trimethyl-phenylamino...)
Affinity DataKi:  1.10E+3nM. Assay description: In vitro inhibitory activity against Urokinase-type plasminogen activator (microPa)
In DepthDetails ArticlePubMed