BDBM50098816 2-(5-Amino-6-oxo-2-pyridin-3-yl-6H-pyrimidin-1-yl)-N-[1-(5-tert-butyl-[1,3,4]oxadiazole-2-carbonyl)-2-methyl-propyl]-acetamide::CHEMBL24604
SMILES CC(C)[C@H](NC(=O)Cn1c(ncc(N)c1=O)-c1cccnc1)C(=O)c1nnc(o1)C(C)(C)C
InChI Key InChIKey=LFNDZAHAHBKVLC-INIZCTEOSA-N
Data  1 KI
  Tab Delimited (TSV)   2D SDfile   Computed 3D by Vconf -m prep SDfile
Find this compound or compounds like it in BindingDB:
Activity Spreadsheet -- Enzyme Inhibition Constant Data from BindingDB
Found 1 hit for monomerid = 50098816
TargetNeutrophil elastase(Homo sapiens (Human))
Cortech
Curated by ChEMBL
LigandPNGBDBM50098816(2-(5-Amino-6-oxo-2-pyridin-3-yl-6H-pyrimidin-1-yl)...)
Affinity DataKi:  16.6nM. Assay description: Binding constant derived from inhibition of elastase catalyzed hydrolysis of synthetic substrate
In DepthDetails ArticlePubMed