BDBM50098817 2-[2-(4-Fluoro-phenyl)-6-oxo-6H-pyrimidin-1-yl]-N-{2-methyl-1-[5-(1-methyl-1-phenyl-ethyl)-[1,3,4]oxadiazole-2-carbonyl]-propyl}-acetamide::CHEMBL279704
SMILES CC(C)[C@H](NC(=O)Cn1c(nccc1=O)-c1ccc(F)cc1)C(=O)c1nnc(o1)C(C)(C)c1ccccc1
InChI Key InChIKey=XISLFGSGXNDPIU-QHCPKHFHSA-N
Data  1 KI
  Tab Delimited (TSV)   2D SDfile   Computed 3D by Vconf -m prep SDfile
Find this compound or compounds like it in BindingDB:
Activity Spreadsheet -- Enzyme Inhibition Constant Data from BindingDB
Found 1 hit for monomerid = 50098817
TargetNeutrophil elastase(Homo sapiens (Human))
Cortech
Curated by ChEMBL
LigandPNGBDBM50098817(2-[2-(4-Fluoro-phenyl)-6-oxo-6H-pyrimidin-1-yl]-N-...)
Affinity DataKi:  3.35nM. Assay description: Binding constant derived from inhibition of elastase catalyzed hydrolysis of synthetic substrate
In DepthDetails ArticlePubMed