BDBM50099306 (4-Chloro-phenyl)-[(3S,4R)-4-(2-fluoro-phenyl)-1-methyl-pyrrolidin-3-yl]-methanone::CHEMBL13499
SMILES CN1C[C@H]([C@@H](C1)c1ccccc1F)C(=O)c1ccc(Cl)cc1
InChI Key InChIKey=LHJBCLDBYVWZGT-JKSUJKDBSA-N
Data  1 KI
  Tab Delimited (TSV)   2D SDfile   Computed 3D by Vconf -m prep SDfile
Find this compound or compounds like it in BindingDB:
Activity Spreadsheet -- Enzyme Inhibition Constant Data from BindingDB
Found 1 hit for monomerid = 50099306
TargetSodium-dependent dopamine transporter(Rattus norvegicus (rat))
Georgetown University Medical Center
Curated by ChEMBL
LigandPNGBDBM50099306((4-Chloro-phenyl)-[(3S,4R)-4-(2-fluoro-phenyl)-1-m...)
Affinity DataKi:  1.28E+3nM. Assay description: Inhibition of [3H]DA uptake at Dopamine transporter in rat cortex.
In DepthDetails ArticlePubMed