BDBM50099309 ((3S,4R)-1-Methyl-4-phenyl-pyrrolidin-3-yl)-phenyl-methanone::CHEMBL276841
SMILES CN1C[C@H]([C@@H](C1)c1ccccc1)C(=O)c1ccccc1
InChI Key InChIKey=SYPUBBORRYKBCW-DLBZAZTESA-N
Data  3 KI
  Tab Delimited (TSV)   2D SDfile   Computed 3D by Vconf -m prep SDfile
Find this compound or compounds like it in BindingDB:
Activity Spreadsheet -- Enzyme Inhibition Constant Data from BindingDB
Found 3 hits for monomerid = 50099309
TargetTransporter(Rattus norvegicus)
Georgetown University Medical Center
Curated by ChEMBL
LigandPNGBDBM50099309(((3S,4R)-1-Methyl-4-phenyl-pyrrolidin-3-yl)-phenyl...)
Affinity DataKi:  150nM. Assay description: Inhibition of [3H]NE uptake at Norepinephrine transporter in rat parietal/occipital cortex was determined
In DepthDetails ArticlePubMed
TargetSodium-dependent serotonin transporter(Rattus norvegicus (rat))
Georgetown University Medical Center
Curated by ChEMBL
LigandPNGBDBM50099309(((3S,4R)-1-Methyl-4-phenyl-pyrrolidin-3-yl)-phenyl...)
Affinity DataKi:  750nM. Assay description: Inhibition of [3H]5-HT uptake at Serotonin transporter in rat mid brain
In DepthDetails ArticlePubMed
TargetSodium-dependent dopamine transporter(Rattus norvegicus (rat))
Georgetown University Medical Center
Curated by ChEMBL
LigandPNGBDBM50099309(((3S,4R)-1-Methyl-4-phenyl-pyrrolidin-3-yl)-phenyl...)
Affinity DataKi:  1.41E+3nM. Assay description: Inhibition of [3H]DA uptake at Dopamine transporter in rat cortex.
In DepthDetails ArticlePubMed