BDBM50100422 (1R,2S,4S,5S)-4-(6-Cyclopentylamino-purin-9-yl)-1-hydroxymethyl-bicyclo[3.1.0]hexan-2-ol::CHEMBL27502
SMILES OC[C@@]12C[C@@H]1[C@H](C[C@@H]2O)n1cnc2c(NC3CCCC3)ncnc12
InChI Key InChIKey=AKUOJWDGUSDCKF-XREXNNHRSA-N
Data  2 KI  1 EC50
  Tab Delimited (TSV)   2D SDfile   Computed 3D by Vconf -m prep SDfile
Find this compound or compounds like it in BindingDB:
Activity Spreadsheet -- Enzyme Inhibition Constant Data from BindingDB
Found 1 hit for monomerid = 50100422
TargetAdenosine receptor A3(Homo sapiens (Human))
Niddk
Curated by ChEMBL
LigandPNGBDBM50100422((1R,2S,4S,5S)-4-(6-Cyclopentylamino-purin-9-yl)-1-...)
Affinity DataKi:  2.88E+3nM. Assay description: Ability to displace specific radioligand [125I]AB-MECA binding at human Adenosine A3 receptor expressed in CHO cells
In DepthDetails ArticlePubMed