BDBM50100550 CHEMBL3321830
SMILES CC(C)OC(=O)N1CCC(CC1)N(C)c1ncnc2c(csc12)-c1ccc(cc1)S(C)(=O)=O
InChI Key InChIKey=ZRUBUGWQCLUALV-UHFFFAOYSA-N
Data  1 EC50
  Tab Delimited (TSV)   2D SDfile   Computed 3D by Vconf -m prep SDfile
Find this compound or compounds like it in BindingDB:
Activity Spreadsheet -- Enzyme Inhibition Constant Data from BindingDB
Found 1 hit for monomerid = 50100550
TargetGlucose-dependent insulinotropic receptor(Homo sapiens (Human))
Korea Research Institute Of Chemical Technology
Curated by ChEMBL
LigandPNGBDBM50100550(CHEMBL3321830)
Affinity DataEC50:  82nM. Assay description: Agonist activity at human GPR119 expressed in CHO-K1 cells after 24 hrs by CRE-luciferase assay
In DepthDetails ArticlePubMed