BDBM50100590 7-(4-Morpholin-4-yl-phenyl)-pteridin-4-ylamine::CHEMBL65852
SMILES Nc1ncnc2nc(cnc12)-c1ccc(cc1)N1CCOCC1
InChI Key InChIKey=WZEORQJKFFGZDN-UHFFFAOYSA-N
Data  2 IC50
  Tab Delimited (TSV)   2D SDfile   Computed 3D by Vconf -m prep SDfile
Find this compound or compounds like it in BindingDB:
Activity Spreadsheet -- Enzyme Inhibition Constant Data from BindingDB
Found 2 hits for monomerid = 50100590
TargetAdenosine kinase(Homo sapiens (Human))
Abbott Laboratories
Curated by ChEMBL
LigandPNGBDBM50100590(7-(4-Morpholin-4-yl-phenyl)-pteridin-4-ylamine | C...)
Affinity DataIC50:  1.00E+3nM. Assay description: Inhibition of adenosine phosphorylation in confluent IMR-32 (human neuroblastoma) cells.
In DepthDetails ArticlePubMed
TargetAdenosine kinase(Rattus norvegicus (rat))
Abbott Laboratories
Curated by ChEMBL
LigandPNGBDBM50100590(7-(4-Morpholin-4-yl-phenyl)-pteridin-4-ylamine | C...)
Affinity DataIC50:  400nM. Assay description: In vitro inhibition of Adenosine kinase (AK)
In DepthDetails ArticlePubMed