BDBM50100904 CHEMBL36615::N-[2-(4'-Cyano-biphenyl-4-yloxy)-ethyl]-N-hydroxy-formamide
SMILES ON(CCOc1ccc(cc1)-c1ccc(cc1)C#N)C=O
InChI Key InChIKey=MJDJFIONJBJENE-UHFFFAOYSA-N
Data  3 IC50
  Tab Delimited (TSV)   2D SDfile   Computed 3D by Vconf -m prep SDfile
Find this compound or compounds like it in BindingDB:
Activity Spreadsheet -- Enzyme Inhibition Constant Data from BindingDB
Found 3 hits for monomerid = 50100904
TargetInterstitial collagenase(Homo sapiens (Human))
Abbott Laboratories
Curated by ChEMBL
LigandPNGBDBM50100904(CHEMBL36615 | N-[2-(4'-Cyano-biphenyl-4-yloxy)-eth...)
Affinity DataIC50: >5.00E+4nM. Assay description: In vitro inhibition of Matrix metalloproteinase-1.
In DepthDetails ArticlePubMed
Target72 kDa type IV collagenase(Homo sapiens (Human))
Abbott Laboratories
Curated by ChEMBL
LigandPNGBDBM50100904(CHEMBL36615 | N-[2-(4'-Cyano-biphenyl-4-yloxy)-eth...)
Affinity DataIC50:  400nM. Assay description: In vitro inhibition of Matrix metalloproteinase-2
In DepthDetails ArticlePubMed
TargetStromelysin-1(Homo sapiens (Human))
Abbott Laboratories
Curated by ChEMBL
LigandPNGBDBM50100904(CHEMBL36615 | N-[2-(4'-Cyano-biphenyl-4-yloxy)-eth...)
Affinity DataIC50:  62nM. Assay description: In vitro inhibition of Matrix metalloproteinase-3
In DepthDetails ArticlePubMed