BDBM50100908 CHEMBL41100::N-[1-(4'-Cyano-biphenyl-4-yloxymethyl)-2-(2,5-dioxo-imidazolidin-1-yl)-ethyl]-N-hydroxy-formamide
SMILES ON(C=O)C(COc1ccc(cc1)-c1ccc(cc1)C#N)Cn1c(O)c[nH]c1=O
InChI Key InChIKey=YQXVSAQYWLGNIT-UHFFFAOYSA-N
Data  3 IC50
  Tab Delimited (TSV)   2D SDfile   Computed 3D by Vconf -m prep SDfile
Find this compound or compounds like it in BindingDB:
Activity Spreadsheet -- Enzyme Inhibition Constant Data from BindingDB
Found 3 hits for monomerid = 50100908
TargetInterstitial collagenase(Homo sapiens (Human))
Abbott Laboratories
Curated by ChEMBL
LigandPNGBDBM50100908(CHEMBL41100 | N-[1-(4'-Cyano-biphenyl-4-yloxymethy...)
Affinity DataIC50:  2.40E+6nM. Assay description: In vitro inhibition of Matrix metalloproteinase-1.
In DepthDetails ArticlePubMed
TargetStromelysin-1(Homo sapiens (Human))
Abbott Laboratories
Curated by ChEMBL
LigandPNGBDBM50100908(CHEMBL41100 | N-[1-(4'-Cyano-biphenyl-4-yloxymethy...)
Affinity DataIC50:  1.40E+4nM. Assay description: In vitro inhibition of Matrix metalloproteinase-3
In DepthDetails ArticlePubMed
Target72 kDa type IV collagenase(Homo sapiens (Human))
Abbott Laboratories
Curated by ChEMBL
LigandPNGBDBM50100908(CHEMBL41100 | N-[1-(4'-Cyano-biphenyl-4-yloxymethy...)
Affinity DataIC50:  8.20E+3nM. Assay description: In vitro inhibition of Matrix metalloproteinase-2
In DepthDetails ArticlePubMed