BDBM50100909 CHEMBL290457::N-[1-(4'-Cyano-biphenyl-4-yloxymethyl)-3-(3,4,4-trimethyl-2,5-dioxo-imidazolidin-1-yl)-propyl]-N-hydroxy-formamide
SMILES CN1C(=O)N(CCC(COc2ccc(cc2)-c2ccc(cc2)C#N)N(O)C=O)C(=O)C1(C)C
InChI Key InChIKey=RNHVOKXLHUNLLK-UHFFFAOYSA-N
Data  3 IC50
  Tab Delimited (TSV)   2D SDfile   Computed 3D by Vconf -m prep SDfile
Find this compound or compounds like it in BindingDB:
Activity Spreadsheet -- Enzyme Inhibition Constant Data from BindingDB
Found 3 hits for monomerid = 50100909
TargetInterstitial collagenase(Homo sapiens (Human))
Abbott Laboratories
Curated by ChEMBL
LigandPNGBDBM50100909(CHEMBL290457 | N-[1-(4'-Cyano-biphenyl-4-yloxymeth...)
Affinity DataIC50: >1.00E+7nM. Assay description: In vitro inhibition of Matrix metalloproteinase-1.
In DepthDetails ArticlePubMed
TargetStromelysin-1(Homo sapiens (Human))
Abbott Laboratories
Curated by ChEMBL
LigandPNGBDBM50100909(CHEMBL290457 | N-[1-(4'-Cyano-biphenyl-4-yloxymeth...)
Affinity DataIC50:  1.70E+4nM. Assay description: In vitro inhibition of Matrix metalloproteinase-3
In DepthDetails ArticlePubMed
Target72 kDa type IV collagenase(Homo sapiens (Human))
Abbott Laboratories
Curated by ChEMBL
LigandPNGBDBM50100909(CHEMBL290457 | N-[1-(4'-Cyano-biphenyl-4-yloxymeth...)
Affinity DataIC50:  4.50E+4nM. Assay description: In vitro inhibition of Matrix metalloproteinase-2
In DepthDetails ArticlePubMed