BDBM50100916 CHEMBL288701::N-[1-(4'-Cyano-biphenyl-4-yloxymethyl)-2-(4,4-dimethyl-2,6-dioxo-piperidin-1-yl)-ethyl]-N-hydroxy-formamide
SMILES CC1(C)CC(=O)N(CC(COc2ccc(cc2)-c2ccc(cc2)C#N)N(O)C=O)C(=O)C1
InChI Key InChIKey=RLIATYHSAHYWGM-UHFFFAOYSA-N
Data  3 IC50
  Tab Delimited (TSV)   2D SDfile   Computed 3D by Vconf -m prep SDfile
Find this compound or compounds like it in BindingDB:
Activity Spreadsheet -- Enzyme Inhibition Constant Data from BindingDB
Found 3 hits for monomerid = 50100916
TargetInterstitial collagenase(Homo sapiens (Human))
Abbott Laboratories
Curated by ChEMBL
LigandPNGBDBM50100916(CHEMBL288701 | N-[1-(4'-Cyano-biphenyl-4-yloxymeth...)
Affinity DataIC50:  3.60E+5nM. Assay description: In vitro inhibition of Matrix metalloproteinase-1.
In DepthDetails ArticlePubMed
TargetStromelysin-1(Homo sapiens (Human))
Abbott Laboratories
Curated by ChEMBL
LigandPNGBDBM50100916(CHEMBL288701 | N-[1-(4'-Cyano-biphenyl-4-yloxymeth...)
Affinity DataIC50:  3.70E+4nM. Assay description: In vitro inhibition of Matrix metalloproteinase-3
In DepthDetails ArticlePubMed
Target72 kDa type IV collagenase(Homo sapiens (Human))
Abbott Laboratories
Curated by ChEMBL
LigandPNGBDBM50100916(CHEMBL288701 | N-[1-(4'-Cyano-biphenyl-4-yloxymeth...)
Affinity DataIC50:  2.50E+4nM. Assay description: In vitro inhibition of Matrix metalloproteinase-2
In DepthDetails ArticlePubMed