BDBM50100918 CHEMBL41102::N-[1-(4'-Cyano-biphenyl-4-yloxymethyl)-2-(4,4-dimethyl-2,5-dioxo-imidazolidin-1-yl)-ethyl]-N-hydroxy-formamide
SMILES CC1(C)NC(=O)N(CC(COc2ccc(cc2)-c2ccc(cc2)C#N)N(O)C=O)C1=O
InChI Key InChIKey=UZBOAJFAUCURIC-UHFFFAOYSA-N
Data  5 IC50
  Tab Delimited (TSV)   2D SDfile   Computed 3D by Vconf -m prep SDfile
Find this compound or compounds like it in BindingDB:
Activity Spreadsheet -- Enzyme Inhibition Constant Data from BindingDB
Found 5 hits for monomerid = 50100918
Target72 kDa type IV collagenase(Homo sapiens (Human))
Abbott Laboratories
Curated by ChEMBL
LigandPNGBDBM50100918(CHEMBL41102 | N-[1-(4'-Cyano-biphenyl-4-yloxymethy...)
Affinity DataIC50:  7.80E+3nM. Assay description: In vitro inhibition of Matrix metalloproteinase-2
In DepthDetails ArticlePubMed
TargetStromelysin-1(Homo sapiens (Human))
Abbott Laboratories
Curated by ChEMBL
LigandPNGBDBM50100918(CHEMBL41102 | N-[1-(4'-Cyano-biphenyl-4-yloxymethy...)
Affinity DataIC50:  2.40E+4nM. Assay description: In vitro inhibition of Matrix metalloproteinase-3
In DepthDetails ArticlePubMed
TargetInterstitial collagenase(Homo sapiens (Human))
Abbott Laboratories
Curated by ChEMBL
LigandPNGBDBM50100918(CHEMBL41102 | N-[1-(4'-Cyano-biphenyl-4-yloxymethy...)
Affinity DataIC50:  2.10E+3nM. Assay description: In vitro inhibition of human Matrix metalloproteinase-1.
In DepthDetails ArticlePubMed
Target72 kDa type IV collagenase(Homo sapiens (Human))
Abbott Laboratories
Curated by ChEMBL
LigandPNGBDBM50100918(CHEMBL41102 | N-[1-(4'-Cyano-biphenyl-4-yloxymethy...)
Affinity DataIC50:  8nM. Assay description: In vitro inhibition of human Matrix metalloproteinase-2.
In DepthDetails ArticlePubMed
TargetInterstitial collagenase(Homo sapiens (Human))
Abbott Laboratories
Curated by ChEMBL
LigandPNGBDBM50100918(CHEMBL41102 | N-[1-(4'-Cyano-biphenyl-4-yloxymethy...)
Affinity DataIC50:  2.10E+6nM. Assay description: In vitro inhibition of Matrix metalloproteinase-1.
In DepthDetails ArticlePubMed