BDBM50101266 CHEMBL47563::[(1S,3R)-1-(2-Carboxymethoxy-4-methoxy-phenyl)-3-(4-methoxy-phenyl)-5-propoxy-1,3-dihydro-isoindol-2-yl]-acetic acid
SMILES CCCOc1ccc2[C@H](N(CC(O)=O)[C@@H](c2c1)c1ccc(OC)cc1)c1ccc(OC)cc1OCC(O)=O
InChI Key InChIKey=WOLXOYFHGNIFKF-WDYNHAJCSA-N
Data  1 IC50
  Tab Delimited (TSV)   2D SDfile   Computed 3D by Vconf -m prep SDfile
Find this compound or compounds like it in BindingDB:
Activity Spreadsheet -- Enzyme Inhibition Constant Data from BindingDB
Found 1 hit for monomerid = 50101266
TargetEndothelin-1 receptor(Homo sapiens (Human))
Novartis Institute For Biomedical Research
Curated by ChEMBL
LigandPNGBDBM50101266(CHEMBL47563 | [(1S,3R)-1-(2-Carboxymethoxy-4-metho...)
Affinity DataIC50: >1.00E+4nM. Assay description: In vitro inhibition of [125I]-ET-1 binding to CHO cells expressing recombinant human Endothelin A receptor
In DepthDetails ArticlePubMed