BDBM50101348 CHEMBL51346::[(S)-4-Methyl-2-(4-sulfamoyl-benzoylamino)-pentanoylamino]-acetic acid
SMILES CC(C)C[C@H](NC(=O)c1ccc(cc1)S(N)(=O)=O)C(=O)NCC(O)=O
InChI Key InChIKey=KUEQVISFZXOMNR-LBPRGKRZSA-N
Data  3 KI
  Tab Delimited (TSV)   2D SDfile   Computed 3D by Vconf -m prep SDfile
Find this compound or compounds like it in BindingDB:
Activity Spreadsheet -- Enzyme Inhibition Constant Data from BindingDB
Found 3 hits for monomerid = 50101348
TargetCarbonic anhydrase 2(Homo sapiens (Human))
Universit£
Curated by ChEMBL
LigandPNGBDBM50101348(CHEMBL51346 | [(S)-4-Methyl-2-(4-sulfamoyl-benzoyl...)
Affinity DataKi:  9nM. Assay description: Binding affinity against human carbonic anhydrase II (hCA -II)
In DepthDetails ArticlePubMed
TargetCarbonic anhydrase 4(Bos taurus (bovine))
Universit£
Curated by ChEMBL
LigandPNGBDBM50101348(CHEMBL51346 | [(S)-4-Methyl-2-(4-sulfamoyl-benzoyl...)
Affinity DataKi:  16nM. Assay description: Compound was evaluated for binding affinity against bovine carbonic anhydrase IV (bCA IV)
In DepthDetails ArticlePubMed
TargetCarbonic anhydrase 1(Homo sapiens (Human))
Universit£
Curated by ChEMBL
LigandPNGBDBM50101348(CHEMBL51346 | [(S)-4-Methyl-2-(4-sulfamoyl-benzoyl...)
Affinity DataKi:  400nM. Assay description: Binding affinity against human carbonic anhydrase I (hCA I)
In DepthDetails ArticlePubMed