BDBM50101361 4-Chloro-3-sulfamoyl-N-(5-sulfamoyl-1H-1lambda*4*-[1,3,4]thiadiazol-2-yl)-benzamide::CHEMBL50128
SMILES NS(=O)(=O)c1nnc(NC(=O)c2ccc(Cl)c(c2)S(N)(=O)=O)s1
InChI Key InChIKey=UOOFMVGXOCHAIN-UHFFFAOYSA-N
Data  3 KI
  Tab Delimited (TSV)   2D SDfile   Computed 3D by Vconf -m prep SDfile
Find this compound or compounds like it in BindingDB:
Activity Spreadsheet -- Enzyme Inhibition Constant Data from BindingDB
Found 3 hits for monomerid = 50101361
TargetCarbonic anhydrase 2(Homo sapiens (Human))
Universit£
Curated by ChEMBL
LigandPNGBDBM50101361(4-Chloro-3-sulfamoyl-N-(5-sulfamoyl-1H-1lambda*4*-...)
Affinity DataKi:  10nM. Assay description: Binding affinity against human carbonic anhydrase II (hCA -II)
In DepthDetails ArticlePubMed
TargetCarbonic anhydrase 1(Homo sapiens (Human))
Universit£
Curated by ChEMBL
LigandPNGBDBM50101361(4-Chloro-3-sulfamoyl-N-(5-sulfamoyl-1H-1lambda*4*-...)
Affinity DataKi:  13nM. Assay description: Binding affinity against human carbonic anhydrase I (hCA I)
In DepthDetails ArticlePubMed
TargetCarbonic anhydrase 4(Bos taurus (bovine))
Universit£
Curated by ChEMBL
LigandPNGBDBM50101361(4-Chloro-3-sulfamoyl-N-(5-sulfamoyl-1H-1lambda*4*-...)
Affinity DataKi:  22nM. Assay description: Compound was evaluated for binding affinity against bovine carbonic anhydrase IV (bCA IV)
In DepthDetails ArticlePubMed