BDBM50101407 2-(2,6-Difluoro-phenyl)-3-(4-methyl-pyridin-2-yl)-thiazolidin-4-one::2-(2,6-difluorophenyl)-3-(4-methylpyridin-2-yl)thiazolidin-4-one::CHEMBL50019
SMILES Cc1ccnc(c1)N1C(SCC1=O)c1c(F)cccc1F
InChI Key InChIKey=NRNTZKJLIWRPHG-UHFFFAOYSA-N
Data  1 IC50
  Tab Delimited (TSV)   2D SDfile   Computed 3D by Vconf -m prep SDfile
Find this compound or compounds like it in BindingDB:
Activity Spreadsheet -- Enzyme Inhibition Constant Data from BindingDB
Found 1 hit for monomerid = 50101407
TargetReverse transcriptase/RNaseH(Human immunodeficiency virus 1)
Università
Curated by ChEMBL
LigandPNGBDBM50101407(2-(2,6-Difluoro-phenyl)-3-(4-methyl-pyridin-2-yl)-...)
Affinity DataIC50:  2.84E+3nM. Assay description: HIV-1 reverse transcriptase (RT) activity using Poly (rC)/oligo (dG) as template/primer and [3H]dGTP
In DepthDetails ArticlePubMed