BDBM50101837 CHEMBL303787::{3-[(1R,2S,3R)-3-Hydroxy-2-((E)-(S)-3-hydroxy-4-o-tolyl-but-1-enyl)-5-oxo-cyclopentylsulfanyl]-propylsulfanyl}-acetic acid
SMILES Cc1ccccc1C[C@H](O)\C=C\[C@H]1[C@H](O)CC(=O)[C@@H]1SCCCSCC(O)=O
InChI Key InChIKey=XOFHGQOZQJBUFN-MNYXPOPXSA-N
Data  5 KI  1 EC50
  Tab Delimited (TSV)   2D SDfile   Computed 3D by Vconf -m prep SDfile
Find this compound or compounds like it in BindingDB:
Activity Spreadsheet -- Enzyme Inhibition Constant Data from BindingDB
Found 6 hits for monomerid = 50101837
TargetProstaglandin E2 receptor EP4 subtype(Mus musculus (Mouse))
Minase Research Institute
Curated by ChEMBL
LigandPNGBDBM50101837(CHEMBL303787 | {3-[(1R,2S,3R)-3-Hydroxy-2-((E)-(S)...)
Affinity DataKi:  22nM. Assay description: Evaluated for its competitive binding affinity towards mouse Prostanoid EP4 receptor in CHO cells expressing prostanoid receptor
In DepthDetails ArticlePubMed
TargetProstaglandin E2 receptor EP3 subtype(Mus musculus (Mouse))
Minase Research Institute
Curated by ChEMBL
LigandPNGBDBM50101837(CHEMBL303787 | {3-[(1R,2S,3R)-3-Hydroxy-2-((E)-(S)...)
Affinity DataKi:  140nM. Assay description: Evaluated for its competitive binding affinity towards mouse Prostanoid EP3 receptor in CHO cells expressing prostanoid receptor
In DepthDetails ArticlePubMed
TargetProstaglandin E2 receptor EP2 subtype(Mus musculus (Mouse))
Minase Research Institute
Curated by ChEMBL
LigandPNGBDBM50101837(CHEMBL303787 | {3-[(1R,2S,3R)-3-Hydroxy-2-((E)-(S)...)
Affinity DataKi:  2.50E+3nM. Assay description: Evaluated for its competitive binding affinity towards mouse Prostanoid EP2 receptor in CHO cells expressing prostanoid receptor
In DepthDetails ArticlePubMed
TargetProstacyclin receptor(Homo sapiens (Human))
Minase Research Institute
Curated by ChEMBL
LigandPNGBDBM50101837(CHEMBL303787 | {3-[(1R,2S,3R)-3-Hydroxy-2-((E)-(S)...)
Affinity DataKi: >1.00E+4nM. Assay description: Evaluated for its competitive binding affinity towards human Prostanoid IP receptor in CHO cells
In DepthDetails ArticlePubMed
TargetProstaglandin E2 receptor EP1 subtype(Mus musculus (Mouse))
Minase Research Institute
Curated by ChEMBL
LigandPNGBDBM50101837(CHEMBL303787 | {3-[(1R,2S,3R)-3-Hydroxy-2-((E)-(S)...)
Affinity DataKi: >1.00E+4nM. Assay description: Evaluated for its competitive binding affinity towards mouse Prostanoid EP1 receptor in CHO cells expressing prostanoid receptor
In DepthDetails ArticlePubMed
TargetProstaglandin E2 receptor EP4 subtype(Mus musculus (Mouse))
Minase Research Institute
Curated by ChEMBL
LigandPNGBDBM50101837(CHEMBL303787 | {3-[(1R,2S,3R)-3-Hydroxy-2-((E)-(S)...)
Affinity DataEC50:  420nM. Assay description: Effective concentration which increases intracellular c-AMP production in mouse Prostanoid EP4 receptor
In DepthDetails ArticlePubMed