BDBM501020 (S)-7-((6-(4- amino-2- oxopyrrolidin- 1-yl)pyridin-2- yl)amino)-4- (1-methyl-1H- pyrrolo[2,3- b]pyridin-4- yl)-2,3- dihydro-1H- pyrrolo[3,4- c]pyridin-1- one::US11021481, Compound I-692::US11078201, Compound I-692::US11548890, Compound I-692
SMILES Cn1ccc2c(ccnc12)-c1ncc(Nc2cccc(n2)N2C[C@@H](N)CC2=O)c2C(=O)NCc12
InChI Key InChIKey=HRBOQGNLXMCFGG-ZDUSSCGKSA-N
Data  5 IC50
  Tab Delimited (TSV)   2D SDfile   Computed 3D by Vconf -m prep SDfile
Find this compound or compounds like it in BindingDB:
Activity Spreadsheet -- Enzyme Inhibition Constant Data from BindingDB
Found 1 hit for monomerid = 501020
TargetMitogen-activated protein kinase kinase kinase kinase 1(Homo sapiens (Human))
Nimbus Saturn
US Patent
LigandPNGBDBM501020((S)-7-((6-(4- amino-2- oxopyrrolidin- 1-yl)pyridin...)
Affinity DataIC50: <100nM. Assay description: HPK1 biochemical enzyme assay: HPK1 enzyme inhibition was measured using a microfluidic mobility shift assay. Reactions were performed in a 384-well ...
Ligand InfoPC cidPC sid
In DepthDetails US Patent