BDBM50103175 CHEMBL71645::N-Hydroxy-2-[(4'-methoxy-biphenyl-4-sulfonyl)-pyridin-3-ylmethyl-amino]-3-methyl-benzamide::N-hydroxy-2-(4'-methoxy-N-(pyridin-3-ylmethyl)biphenyl-4-ylsulfonamido)-3-methylbenzamide
SMILES COc1ccc(cc1)-c1ccc(cc1)S(=O)(=O)N(Cc1cccnc1)c1c(C)cccc1C(=O)NO
InChI Key InChIKey=WMBVCTBFQRRSBU-UHFFFAOYSA-N
Data  6 IC50
  Tab Delimited (TSV)   2D SDfile   Computed 3D by Vconf -m prep SDfile
Find this compound or compounds like it in BindingDB:
Activity Spreadsheet -- Enzyme Inhibition Constant Data from BindingDB
Found 6 hits for monomerid = 50103175
TargetMatrix metalloproteinase-9(Homo sapiens (Human))
University Of Athens
Curated by ChEMBL
LigandPNGBDBM50103175(CHEMBL71645 | N-Hydroxy-2-[(4'-methoxy-biphenyl-4-...)
Affinity DataIC50:  152nM. Assay description: Inhibition of MMP9
In DepthDetails ArticlePubMed
TargetCollagenase 3(Homo sapiens (Human))
University Of Athens
Curated by ChEMBL
LigandPNGBDBM50103175(CHEMBL71645 | N-Hydroxy-2-[(4'-methoxy-biphenyl-4-...)
Affinity DataIC50:  18nM. Assay description: Inhibition of MMP13
In DepthDetails ArticlePubMed
TargetMatrix metalloproteinase-9(Homo sapiens (Human))
University Of Athens
Curated by ChEMBL
LigandPNGBDBM50103175(CHEMBL71645 | N-Hydroxy-2-[(4'-methoxy-biphenyl-4-...)
Affinity DataIC50:  152nM. Assay description: In vitro ability to inhibit matrix metalloprotease-9.
In DepthDetails ArticlePubMed
TargetCollagenase 3(Homo sapiens (Human))
University Of Athens
Curated by ChEMBL
LigandPNGBDBM50103175(CHEMBL71645 | N-Hydroxy-2-[(4'-methoxy-biphenyl-4-...)
Affinity DataIC50:  18nM. Assay description: Inhibition of matrix metalloprotease-13
In DepthDetails ArticlePubMed
TargetInterstitial collagenase(Homo sapiens (Human))
Wyeth-Ayerst Research
Curated by ChEMBL
LigandPNGBDBM50103175(CHEMBL71645 | N-Hydroxy-2-[(4'-methoxy-biphenyl-4-...)
Affinity DataIC50:  2.27E+3nM. Assay description: In vitro inhibition of Matrix metalloprotease-1
In DepthDetails ArticlePubMed
TargetInterstitial collagenase(Homo sapiens (Human))
Wyeth-Ayerst Research
Curated by ChEMBL
LigandPNGBDBM50103175(CHEMBL71645 | N-Hydroxy-2-[(4'-methoxy-biphenyl-4-...)
Affinity DataIC50:  2.27E+3nM. Assay description: Inhibition of MMP1
In DepthDetails ArticlePubMed