BDBM501034 7-((5-(4- (dimethylami- no)tetrahydro- 2H-pyran-4- yl)pyridin-2- yl)amino)-4-(7- fluoroimidazo [1,2-a]pyridin- 3-yl)isoindolin- 1-one::US11021481, Compound I-706::US11078201, Compound I-706::US11548890, Compound I-706
SMILES CN(C)C1(CCOCC1)c1ccc(Nc2ccc(c3CNC(=O)c23)-c2cnc3cc(F)ccn23)nc1
InChI Key InChIKey=AHBYFILVVAXTOB-UHFFFAOYSA-N
Data  5 IC50
  Tab Delimited (TSV)   2D SDfile   Computed 3D by Vconf -m prep SDfile
Find this compound or compounds like it in BindingDB:
Activity Spreadsheet -- Enzyme Inhibition Constant Data from BindingDB
Found 5 hits for monomerid = 501034
TargetMitogen-activated protein kinase kinase kinase kinase 1(Homo sapiens (Human))
Nimbus Saturn
US Patent
LigandPNGBDBM501034(7-((5-(4- (dimethylami- no)tetrahydro- 2H-pyran-4-...)
Affinity DataIC50: <100nM. Assay description: HPK1 biochemical enzyme assay: HPK1 enzyme inhibition was measured using a microfluidic mobility shift assay. Reactions were performed in a 384-well ...
Ligand InfoPC cidPC sid
In DepthDetails US Patent
TargetMitogen-activated protein kinase kinase kinase kinase 1(Homo sapiens (Human))
Nimbus Saturn
US Patent
LigandPNGBDBM501034(7-((5-(4- (dimethylami- no)tetrahydro- 2H-pyran-4-...)
Affinity DataIC50: <100nM. Assay description: HPK1 biochemical enzyme assay: HPK1 enzyme inhibition was measured using a microfluidic mobility shift assay. Reactions were performed in a 384-well ...
Ligand InfoPC cidPC sid
In DepthDetails US Patent
TargetMitogen-activated protein kinase kinase kinase kinase 1(Homo sapiens (Human))
Nimbus Saturn
US Patent
LigandPNGBDBM501034(7-((5-(4- (dimethylami- no)tetrahydro- 2H-pyran-4-...)
Affinity DataIC50: <100nM. Assay description: HPK1 biochemical enzyme assay: HPK1 enzyme inhibition was measured using a microfluidic mobility shift assay. Reactions were performed in a 384-well ...
Ligand InfoPC cidPC sid
In DepthDetails US Patent
TargetMitogen-activated protein kinase kinase kinase kinase 1(Homo sapiens (Human))
Nimbus Saturn
US Patent
LigandPNGBDBM501034(7-((5-(4- (dimethylami- no)tetrahydro- 2H-pyran-4-...)
Affinity DataIC50: <100nM. Assay description: HPK1 biochemical enzyme assay: HPK1 enzyme inhibition was measured using a microfluidic mobility shift assay. Reactions were performed in a 384-well ...
Ligand InfoPC cidPC sid
In DepthDetails US Patent
TargetMitogen-activated protein kinase kinase kinase kinase 1(Homo sapiens (Human))
Nimbus Saturn
US Patent
LigandPNGBDBM501034(7-((5-(4- (dimethylami- no)tetrahydro- 2H-pyran-4-...)
Affinity DataIC50: <100nM. Assay description: HPK1 biochemical enzyme assay: HPK1 enzyme inhibition was measured using a microfluidic mobility shift assay. Reactions were performed in a 384-well ...
Ligand InfoPC cidPC sid
In DepthDetails US Patent