BDBM50103781 (4-{2-Acetylamino-2-[1-(3-carbamoyl-4-cyclohexylmethoxy-phenyl)-1-methyl-ethylcarbamoyl]-ethyl}-2-phosphono-phenoxy)-acetic acid::CHEMBL265777
SMILES CC(=O)NC(Cc1ccc(OCC(O)=O)c(c1)P(O)(O)=O)C(=O)NC(C)(C)c1ccc(OCC2CCCCC2)c(c1)C(N)=O
InChI Key InChIKey=HXUVSTZIEQEVSV-UHFFFAOYSA-N
Data  3 IC50
  Tab Delimited (TSV)   2D SDfile   Computed 3D by Vconf -m prep SDfile
Find this compound or compounds like it in BindingDB:
Activity Spreadsheet -- Enzyme Inhibition Constant Data from BindingDB
Found 3 hits for monomerid = 50103781
TargetTyrosine-protein kinase Yes(Homo sapiens (Human))
Ariad Pharmaceuticals
Curated by ChEMBL
LigandPNGBDBM50103781((4-{2-Acetylamino-2-[1-(3-carbamoyl-4-cyclohexylme...)
Affinity DataIC50:  9.45E+4nM. Assay description: Inhibition of binding to Yes SH2 domain
In DepthDetails ArticlePubMed
TargetProto-oncogene tyrosine-protein kinase Src(Homo sapiens (Human))
Ariad Pharmaceuticals
Curated by ChEMBL
LigandPNGBDBM50103781((4-{2-Acetylamino-2-[1-(3-carbamoyl-4-cyclohexylme...)
Affinity DataIC50:  3.20E+3nM. Assay description: Inhibition of binding to Src SH2 domain
In DepthDetails ArticlePubMed
TargetTyrosine-protein kinase ZAP-70(Homo sapiens (Human))
Ariad Pharmaceuticals
Curated by ChEMBL
LigandPNGBDBM50103781((4-{2-Acetylamino-2-[1-(3-carbamoyl-4-cyclohexylme...)
Affinity DataIC50: >5.00E+5nM. Assay description: Inhibition of binding to Zap70 protein kinase
In DepthDetails ArticlePubMed