BDBM501041 (R)-7-((6- ((dimethylamino)- methyl)-5- (tetrahydrofuran- 3-yl)pyridin- 2-yl)amino)-4- (imidazo[1,2- a]pyrazin-3- yl)isoindolin- 1-one::US11021481, Compound I-713::US11078201, Compound I-713::US11548890, Compound I-713
SMILES CN(C)Cc1nc(Nc2ccc(c3CNC(=O)c23)-c2cnc3cnccn23)ccc1[C@H]1CCOC1
InChI Key InChIKey=DAWBCDYWPFAXJZ-INIZCTEOSA-N
Data  5 IC50
  Tab Delimited (TSV)   2D SDfile   Computed 3D by Vconf -m prep SDfile
Find this compound or compounds like it in BindingDB:
Activity Spreadsheet -- Enzyme Inhibition Constant Data from BindingDB
Found 5 hits for monomerid = 501041
TargetMitogen-activated protein kinase kinase kinase kinase 1(Homo sapiens (Human))
Nimbus Saturn
US Patent
LigandPNGBDBM501041((R)-7-((6- ((dimethylamino)- methyl)-5- (tetrahydr...)
Affinity DataIC50: <100nM. Assay description: HPK1 biochemical enzyme assay: HPK1 enzyme inhibition was measured using a microfluidic mobility shift assay. Reactions were performed in a 384-well ...
Ligand InfoPC cidPC sid
In DepthDetails US Patent
TargetMitogen-activated protein kinase kinase kinase kinase 1(Homo sapiens (Human))
Nimbus Saturn
US Patent
LigandPNGBDBM501041((R)-7-((6- ((dimethylamino)- methyl)-5- (tetrahydr...)
Affinity DataIC50: <100nM. Assay description: HPK1 biochemical enzyme assay: HPK1 enzyme inhibition was measured using a microfluidic mobility shift assay. Reactions were performed in a 384-well ...
Ligand InfoPC cidPC sid
In DepthDetails US Patent
TargetMitogen-activated protein kinase kinase kinase kinase 1(Homo sapiens (Human))
Nimbus Saturn
US Patent
LigandPNGBDBM501041((R)-7-((6- ((dimethylamino)- methyl)-5- (tetrahydr...)
Affinity DataIC50: <100nM. Assay description: HPK1 biochemical enzyme assay: HPK1 enzyme inhibition was measured using a microfluidic mobility shift assay. Reactions were performed in a 384-well ...
Ligand InfoPC cidPC sid
In DepthDetails US Patent
TargetMitogen-activated protein kinase kinase kinase kinase 1(Homo sapiens (Human))
Nimbus Saturn
US Patent
LigandPNGBDBM501041((R)-7-((6- ((dimethylamino)- methyl)-5- (tetrahydr...)
Affinity DataIC50: <100nM. Assay description: HPK1 biochemical enzyme assay: HPK1 enzyme inhibition was measured using a microfluidic mobility shift assay. Reactions were performed in a 384-well ...
Ligand InfoPC cidPC sid
In DepthDetails US Patent
TargetMitogen-activated protein kinase kinase kinase kinase 1(Homo sapiens (Human))
Nimbus Saturn
US Patent
LigandPNGBDBM501041((R)-7-((6- ((dimethylamino)- methyl)-5- (tetrahydr...)
Affinity DataIC50: <100nM. Assay description: HPK1 biochemical enzyme assay: HPK1 enzyme inhibition was measured using a microfluidic mobility shift assay. Reactions were performed in a 384-well ...
Ligand InfoPC cidPC sid
In DepthDetails US Patent