BDBM50104402 2-Methyl-3,4-dihydro-2H-pyrrole-3,4-diol::CHEMBL85846
SMILES CC1NCC(O)C1=O
InChI Key InChIKey=NSDLOABWWPNEIU-UHFFFAOYSA-N
Data  1 KI
  Tab Delimited (TSV)   2D SDfile   Computed 3D by Vconf -m prep SDfile
Find this compound or compounds like it in BindingDB:
Activity Spreadsheet -- Enzyme Inhibition Constant Data from BindingDB
Found 1 hit for monomerid = 50104402
TargetTissue alpha-L-fucosidase(Homo sapiens (Human))
Universidad De Sevilla
Curated by ChEMBL
LigandPNGBDBM50104402(2-Methyl-3,4-dihydro-2H-pyrrole-3,4-diol | CHEMBL8...)
Affinity DataKi:  160nM. Assay description: In vitro inhibition of alpha-L-fucosidase isolated from bovine kidney.
In DepthDetails ArticlePubMed