BDBM50104734 CHEMBL3593943
SMILES C=CCCCN=C=S
InChI Key InChIKey=DBISBKDNOKIADM-UHFFFAOYSA-N
Data  1 EC50
  Tab Delimited (TSV)   2D SDfile   Computed 3D by Vconf -m prep SDfile
Find this compound or compounds like it in BindingDB:
Activity Spreadsheet -- Enzyme Inhibition Constant Data from BindingDB
Found 1 hit for monomerid = 50104734
TargetTransient receptor potential cation channel subfamily A member 1(Homo sapiens (Human))
University Of Shizuoka
Curated by ChEMBL
LigandPNGBDBM50104734(CHEMBL3593943)
Affinity DataEC50:  540nM. Assay description: Activation of human TRPA1 expressed in TREx-HEK cells by Fluo-4 AM dye-based Ca2+ imaging assay
In DepthDetails ArticlePubMed