BDBM50104737 Erucin
SMILES CSCCCCN=C=S
InChI Key InChIKey=IHQDGXUYTSZGOG-UHFFFAOYSA-N
Data  1 EC50
  Tab Delimited (TSV)   2D SDfile   Computed 3D by Vconf -m prep SDfile
Find this compound or compounds like it in BindingDB:
Activity Spreadsheet -- Enzyme Inhibition Constant Data from BindingDB
Found 1 hit for monomerid = 50104737
TargetTransient receptor potential cation channel subfamily A member 1(Homo sapiens (Human))
University Of Shizuoka
Curated by ChEMBL
LigandPNGBDBM50104737(Erucin)
Affinity DataEC50:  420nM. Assay description: Activation of human TRPA1 expressed in TREx-HEK cells by Fluo-4 AM dye-based Ca2+ imaging assay
In DepthDetails ArticlePubMed