BDBM50104933 CHEMBL105821::{4-[(4-Bromo-phenyl)-ethoxyimino-methyl]-4'-methyl-[1,4']bipiperidinyl-1'-yl}-(2,4-dimethyl-pyridin-3-yl)-methanone
SMILES CCO\N=C(\C1CCN(CC1)C1(C)CCN(CC1)C(=O)c1c(C)ccnc1C)c1ccc(Br)cc1
InChI Key InChIKey=UCANOSVRVFBCJE-GKPLWNPISA-N
Data  2 KI
  Tab Delimited (TSV)   2D SDfile   Computed 3D by Vconf -m prep SDfile
Find this compound or compounds like it in BindingDB:
Activity Spreadsheet -- Enzyme Inhibition Constant Data from BindingDB
Found 2 hits for monomerid = 50104933
TargetC-C chemokine receptor type 5(Homo sapiens (Human))
Schering-Plough Research Institute
Curated by ChEMBL
LigandPNGBDBM50104933(CHEMBL105821 | {4-[(4-Bromo-phenyl)-ethoxyimino-me...)
Affinity DataKi:  1.10nM. Assay description: Inhibition of RANTES binding to C-C chemokine receptor type 5
In DepthDetails ArticlePubMed
TargetC-C chemokine receptor type 5(Mus musculus)
Schering-Plough Research Institute
Curated by ChEMBL
LigandPNGBDBM50104933(CHEMBL105821 | {4-[(4-Bromo-phenyl)-ethoxyimino-me...)
Affinity DataKi:  1.10nM. Assay description: Inhibition of RANTES binding to Chemokine receptor type 5 receptor from NIH 3T3 cells
In DepthDetails ArticlePubMed