BDBM50105118 CHEMBL536324::N1,N9-Di(3-(((4-amino-6-(dimethylamino-1,3,5-triazin-2-yl)methyl)amino)propyl)-1,9nonanediamine Heptachloride
SMILES CN(C)c1nc(N)nc(CN(CCCNCCCCCCCCCNCCCN(Cc2nc(N)nc(n2)N(C)C)Cc2nc(N)nc(n2)N(C)C)Cc2nc(N)nc(n2)N(C)C)n1
InChI Key InChIKey=OPDKFDHEACVFON-UHFFFAOYSA-N
Data  1 KI
  Tab Delimited (TSV)   2D SDfile   Computed 3D by Vconf -m prep SDfile
Find this compound or compounds like it in BindingDB:
Activity Spreadsheet -- Enzyme Inhibition Constant Data from BindingDB
Found 1 hit for monomerid = 50105118
TargetAdenosine transporter 1(Trypanosoma brucei)
Cardiff University
Curated by ChEMBL
LigandPNGBDBM50105118(CHEMBL536324 | N1,N9-Di(3-(((4-amino-6-(dimethylam...)
Affinity DataKi:  1.70E+4nM. Assay description: Ability to inhibit adenosine uptake by the P2 transporter in Trypanosoma brucei
In DepthDetails ArticlePubMed