BDBM50105127 CHEMBL538771::N2-(3-[4-(3-[(4,6-Diamino-1,3,5-triazin-2-yl)amino]propylamino)cyclohexyl]aminopropyl)-1,3,5-triazine-2,4,6-triamine Tetrahydrochloride
SMILES Nc1nc(N)nc(NCCCNC2CCC(CC2)NCCCNc2nc(N)nc(N)n2)n1
InChI Key InChIKey=BBIGXTPNTICTEF-UHFFFAOYSA-N
Data  1 KI
  Tab Delimited (TSV)   2D SDfile   Computed 3D by Vconf -m prep SDfile
Find this compound or compounds like it in BindingDB:
Activity Spreadsheet -- Enzyme Inhibition Constant Data from BindingDB
Found 1 hit for monomerid = 50105127
TargetAdenosine transporter 1(Trypanosoma brucei)
Cardiff University
Curated by ChEMBL
LigandPNGBDBM50105127(CHEMBL538771 | N2-(3-[4-(3-[(4,6-Diamino-1,3,5-tri...)
Affinity DataKi:  1.25E+5nM. Assay description: Ability to inhibit adenosine uptake by the P2 transporter in Trypanosoma brucei
In DepthDetails ArticlePubMed