BDBM50106268 CHEMBL124971::[2-(1-Benzenesulfonyl-5-methoxy-2,3-dihydro-1H-indol-3-yl)-ethyl]-dimethyl-amine
SMILES COc1ccc2N(CC(CCN(C)C)c2c1)S(=O)(=O)c1ccccc1
InChI Key InChIKey=LWEWWHJJZIXSLB-UHFFFAOYSA-N
Data  1 KI
  Tab Delimited (TSV)   2D SDfile   Computed 3D by Vconf -m prep SDfile
Find this compound or compounds like it in BindingDB:
Activity Spreadsheet -- Enzyme Inhibition Constant Data from BindingDB
Found 1 hit for monomerid = 50106268
Target5-hydroxytryptamine receptor 6(Homo sapiens (Human))
Merck Sharp & Dohme Research Laboratories
Curated by ChEMBL
LigandPNGBDBM50106268(CHEMBL124971 | [2-(1-Benzenesulfonyl-5-methoxy-2,3...)
Affinity DataKi:  63nM. Assay description: Binding affinity as displacement of [3H]-5-HT binding to 5-hydroxytryptamine 6 receptor in HeLa cells.
In DepthDetails ArticlePubMed