BDBM50106851 2-(4-{(R)-1-[(R)-2-Hydroxy-2-(4-hydroxy-3-methanesulfonylamino-phenyl)-ethylamino]-2-phenyl-ethyl}-phenyl)-acetamide::CHEMBL319186
SMILES CS(=O)(=O)Nc1cc(ccc1O)[C@@H](O)CN[C@H](Cc1ccccc1)c1ccc(CC(N)=O)cc1
InChI Key InChIKey=BPCMUCQPFCDFRH-QPPBQGQZSA-N
Data  1 KI
  Tab Delimited (TSV)   2D SDfile   Computed 3D by Vconf -m prep SDfile
Find this compound or compounds like it in BindingDB:
Activity Spreadsheet -- Enzyme Inhibition Constant Data from BindingDB
Found 1 hit for monomerid = 50106851
TargetBeta-3 adrenergic receptor(Homo sapiens (Human))
Bristol-Myers Squibb Pharmaceutical Research Institute
Curated by ChEMBL
LigandPNGBDBM50106851(2-(4-{(R)-1-[(R)-2-Hydroxy-2-(4-hydroxy-3-methanes...)
Affinity DataKi:  74nM. Assay description: Binding affinity to CHO cells expressing the cloned human beta-3 adrenergic receptor in the presence of [125I]-iodocyanopindolol
In DepthDetails ArticlePubMed