BDBM50107859 (+-)-2-(1-Methyl-piperidin-2-yl)-chroman-6-ol::CHEMBL143162
SMILES CN1CCCC[C@H]1[C@H]1CCc2cc(O)ccc2O1
InChI Key InChIKey=OYMKMVHQLKXIBG-DZGCQCFKSA-N
Data  1 KI
  Tab Delimited (TSV)   2D SDfile   Computed 3D by Vconf -m prep SDfile
Find this compound or compounds like it in BindingDB:
Activity Spreadsheet -- Enzyme Inhibition Constant Data from BindingDB
Found 1 hit for monomerid = 50107859
TargetNeuronal acetylcholine receptor subunit alpha-7(Rattus norvegicus (Rat))
University Of Minnesota
Curated by ChEMBL
LigandPNGBDBM50107859((+-)-2-(1-Methyl-piperidin-2-yl)-chroman-6-ol | CH...)
Affinity DataKi: >1.00E+4nM. Assay description: In vitro binding affinity towards Nicotinic acetylcholine receptor alpha7 using [125I]alpha-bungarotoxin in rat brain
In DepthDetails ArticlePubMed