BDBM50107956 6-[(4-Chloro-naphthalen-1-ylamino)-methyl]-5-methyl-pyrido[2,3-d]pyrimidine-2,4-diamine::CHEMBL150317
SMILES Cc1c(CNc2ccc(Cl)c3ccccc23)cnc2nc(N)nc(N)c12
InChI Key InChIKey=YKOLXVQOKFSRQJ-UHFFFAOYSA-N
Data  2 IC50
  Tab Delimited (TSV)   2D SDfile   Computed 3D by Vconf -m prep SDfile
Find this compound or compounds like it in BindingDB:
Activity Spreadsheet -- Enzyme Inhibition Constant Data from BindingDB
Found 2 hits for monomerid = 50107956
TargetDihydrofolate reductase(Homo sapiens (Human))
Lindsley F. Kimball Research Institute
Curated by ChEMBL
LigandPNGBDBM50107956(6-[(4-Chloro-naphthalen-1-ylamino)-methyl]-5-methy...)
Affinity DataIC50:  0.430nM. Assay description: Antimycobacterial activity against Mycobacterium avium complex diihydrofolate reductase (MAC DHFR)
In DepthDetails ArticlePubMed
TargetDihydrofolate reductase(Homo sapiens (Human))
Lindsley F. Kimball Research Institute
Curated by ChEMBL
LigandPNGBDBM50107956(6-[(4-Chloro-naphthalen-1-ylamino)-methyl]-5-methy...)
Affinity DataIC50:  2nM. Assay description: Antimycobacterial activity against human dihydrofolate reductase (hDHFR)
In DepthDetails ArticlePubMed