BDBM50107979 6-[(4-Bromo-3-methyl-phenylamino)-methyl]-5-methyl-pyrido[2,3-d]pyrimidine-2,4-diamine::CHEMBL150382
SMILES Cc1cc(NCc2cnc3nc(N)nc(N)c3c2C)ccc1Br
InChI Key InChIKey=YIWKNSVDJMQTLC-UHFFFAOYSA-N
Data  2 IC50
  Tab Delimited (TSV)   2D SDfile   Computed 3D by Vconf -m prep SDfile
Find this compound or compounds like it in BindingDB:
Activity Spreadsheet -- Enzyme Inhibition Constant Data from BindingDB
Found 2 hits for monomerid = 50107979
TargetDihydrofolate reductase(Homo sapiens (Human))
Lindsley F. Kimball Research Institute
Curated by ChEMBL
LigandPNGBDBM50107979(6-[(4-Bromo-3-methyl-phenylamino)-methyl]-5-methyl...)
Affinity DataIC50:  6.10nM. Assay description: Antimycobacterial activity against human dihydrofolate reductase (hDHFR)
In DepthDetails ArticlePubMed
TargetDihydrofolate reductase(Homo sapiens (Human))
Lindsley F. Kimball Research Institute
Curated by ChEMBL
LigandPNGBDBM50107979(6-[(4-Bromo-3-methyl-phenylamino)-methyl]-5-methyl...)
Affinity DataIC50:  0.870nM. Assay description: Antimycobacterial activity against Mycobacterium avium complex diihydrofolate reductase (MAC DHFR)
In DepthDetails ArticlePubMed