BDBM50108443 3-(2,5-Difluoro-phenyl)-1-(1-phenyl-2-pyrrolidin-1-yl-ethyl)-1H-pyridin-2-one::CHEMBL416136
SMILES Fc1ccc(F)c(c1)-c1cccn(C(CN2CCCC2)c2ccccc2)c1=O
InChI Key InChIKey=XFMLKAFLDRDBOZ-UHFFFAOYSA-N
Data  3 IC50
  Tab Delimited (TSV)   2D SDfile   Computed 3D by Vconf -m prep SDfile
Find this compound or compounds like it in BindingDB:
Activity Spreadsheet -- Enzyme Inhibition Constant Data from BindingDB
Found 3 hits for monomerid = 50108443
TargetDelta-type opioid receptor(Homo sapiens (Human))
Astrazeneca R&D MöLndal
Curated by ChEMBL
LigandPNGBDBM50108443(3-(2,5-Difluoro-phenyl)-1-(1-phenyl-2-pyrrolidin-1...)
Affinity DataIC50: >1.00E+4nM. Assay description: Binding affinity towards delta opioid receptor by the displacement of [125I]-Deltorphin
In DepthDetails ArticlePubMed
TargetMu-type opioid receptor(Homo sapiens (Human))
Astrazeneca R&D MöLndal
Curated by ChEMBL
LigandPNGBDBM50108443(3-(2,5-Difluoro-phenyl)-1-(1-phenyl-2-pyrrolidin-1...)
Affinity DataIC50: >1.00E+4nM. Assay description: Binding affinity towards mu opioid receptor by the displacement of [125I]-Enkephalin
In DepthDetails ArticlePubMed
TargetKappa-type opioid receptor(Homo sapiens (Human))
Astrazeneca R&D MöLndal
Curated by ChEMBL
LigandPNGBDBM50108443(3-(2,5-Difluoro-phenyl)-1-(1-phenyl-2-pyrrolidin-1...)
Affinity DataIC50:  23nM. Assay description: Binding affinity towards kappa opioid receptor by the displacement of [125I]-(D-Pro10)-Dynorphin A
In DepthDetails ArticlePubMed