BDBM50108472 (R)-2-{3'-[3-(1,3-Dihydro-benzoimidazol-2-ylidene)-ureido]-biphenyl-3-sulfonylamino}-propionic acid::CHEMBL62569
SMILES C[C@@H](NS(=O)(=O)c1cccc(c1)-c1cccc(NC(=O)Nc2nc3ccccc3[nH]2)c1)C(O)=O
InChI Key InChIKey=DEDJXJGXINGTOV-CQSZACIVSA-N
Data  1 KI
  Tab Delimited (TSV)   2D SDfile   Computed 3D by Vconf -m prep SDfile
Find this compound or compounds like it in BindingDB:
Activity Spreadsheet -- Enzyme Inhibition Constant Data from BindingDB
Found 1 hit for monomerid = 50108472
TargetIntegrin alpha-V/beta-3(Homo sapiens (Human))
Bayer
Curated by ChEMBL
LigandPNGBDBM50108472((R)-2-{3'-[3-(1,3-Dihydro-benzoimidazol-2-ylidene)...)
Affinity DataKi: >1.00E+4nM. Assay description: In vitro activity in an vitronectin receptor (alpha v beta3) scintillation bead assay using 125-I labelled echistatin as a radioligand
In DepthDetails ArticlePubMed